BDBM257675 US9493446, 145
SMILES Cc1ccc(c(C(=O)N2CCC[C@H]2c2nc(no2)-c2ccccc2OC(F)(F)F)c1F)-n1nccn1
InChI Key InChIKey=AEVKXGFMSDEVKH-INIZCTEOSA-N
Data  2 IC50
  Tab Delimited (TSV)   2D SDfile   Computed 3D by Vconf -m prep SDfile
Find this compound or compounds like it in BindingDB:
Activity Spreadsheet -- Enzyme Inhibition Constant Data from BindingDB
Found 1 hit for monomerid = 257675
TargetOrexin/Hypocretin receptor type 1(Homo sapiens (Human))
Actelion Pharmaceuticals
US Patent
LigandPNGBDBM257675(US9493446, 145)
Affinity DataIC50:  19nMT: 2°C. Assay description: Human orexin-A as an agonist is prepared as 1 mM stock solution in MeOH: water (1:1), diluted in HBSS containing 0.1% bovine serum albumin (BSA), NaH...
Ligand InfoPC cidPC sid
In DepthDetails US Patent